{"text_format":"1","workbook":"xlsx","n_sheets":3,"sheets":["Sayfa2","4LUK","5LIK"],"not_rendered":{"charts":0,"images":1,"macros":1,"external_links":0,"defined_names":58,"comments":0,"pivot_tables":0},"unopened":[],"bounds":{"document_bytes":16777216,"sheet_cells":100000,"rows_first":2000,"rows_last":500,"rows_between":2000,"halvings":0,"cell_chars":16384,"cell_head_chars":4096},"cells_cut":0,"cells_raw":0,"read":"whole","date_system":"1900"}

{"sheet":"Sayfa2","index":0,"n_rows":318,"n_cols":84,"rows_kept":318,"cut":false,"hidden":false,"merged":[[0,10,4,14],[0,3,4,9],[16,14,17,14],[5,3,5,4],[5,5,5,6],[5,7,5,8],[5,9,5,10],[5,12,5,13],[8,0,14,0],[6,0,6,14],[8,3,8,9],[11,3,11,9],[12,3,12,9],[13,3,13,9],[9,3,9,9],[10,3,10,9],[14,3,14,9],[8,12,12,12],[16,2,17,2],[16,0,17,0],[16,3,17,3],[16,4,17,4],[16,13,17,13],[16,7,17,7],[16,8,17,8],[16,5,17,5],[16,6,17,6],[16,1,17,1]]}
[null,null,null,"GEBZE TEKNİK ÜNİVERSİTESİ REKTÖRLÜĞÜ\nSONUÇ AÇIKLAMA FORMU  ",null,null,null,null,null,null,null,null,null,null,null,null,null,"UNVAN","DERECE","ADET","SONUÇ","MEZUNİYET",null,"Birimler","Rektörlük","Bölümler","Rektörlük","Mühendislik Fakültesi","Temel Bilimler Fakültesi","İşletme Fakültesi","Mimarlık Fakültesi","Havacılık ve Uzay Bilimleri Fakültesi","Bilişim Teknolojileri Enstitüsü","Biyoteknoloji Enstitüsü","Enerji Teknolojileri Enstitüsü","Lisansüstü Eğitim Enstitüsü","Nanoteknoloji Enstitüsü","Savunma Teknolojileri Enstitüsü","Siber Güvenlik Meslek Yüksekokulu","Ulaşım Teknolojileri Enstitüsü","Yer ve Deniz Bilimleri Enstitüsü","Anabilm Dalı","Beden Eğitimi ve Spor","Enformatik","Türkçe Hazırlık","Yabancı Diller","Bilgisayar Mühendisliği","Biyomühendislik","Çevre Mühendisliği","Elektronik Mühendisliği","Endüstri Mühendisliği","Harita Mühendisliği","İnşaat Mühendisliği","Kimya Mühendisliği","Makine Mühendisliği","Malzeme Bilimi ve Mühendisliği","Fizik","Kimya","Matematik","Moleküler Biyoloji ve Genetik","İktisat","İşletme","Strateji Bilimi","Yönetim Bilişim Sistemleri","Endüstriyel Tasarım","Mimarlık","Şehir ve Bölge Planlama","Uçak Mühendisliği","Bilişim Teknolojileri ABD","Biyoteknoloji ABD","Enerji Teknolojileri ABD","Nanobilim ve Nanomühendislik ABD","Savunma Teknolojileri ABD","Ulaşım Teknolojileri ABD","Bilgisayar Teknolojileri","LEE","Rektörlük Uygulamalı Birim","Rektörlük Ders Verilecek Birim","Yer ve Deniz Bilimleri ABD"]
[null,null,null,null,null,null,null,null,null,null,null,null,null,null,null,null,{"$f":"SUBSTITUTE(D9,\" \",\"_\")","v":"Siber_Güvenlik_Meslek_Yüksekokulu"},"Araştırma Görevlisi",1,1,"Başarılı (Asıl)","4 lük",null,null,"Mühendislik Fakültesi",null,"Rektörlük Uygulamalı Birim","Bilgisayar Mühendisliği","Fizik","İktisat","Endüstriyel Tasarım","Uçak Mühendisliği","Bilişim Teknolojileri ABD","Biyoteknoloji ABD","Enerji Teknolojileri ABD","LEE","Nanobilim ve Nanomühendislik ABD","Savunma Teknolojileri ABD","Bilgisayar Teknolojileri","Ulaşım Teknolojileri ABD","Yer ve Deniz Bilimleri ABD",null,"-","-","-","-","Bilgisayar Donanımı","Biyoelektronik","Çevre Mühendisliği Temel Bilimleri","Devreler ve Sistemler Teorisi","Endüstri Mühendisliği ABD","Fotogrametri ve Uzaktan Algılama","Geoteknik","Gıda Teknolojisi","Enerji Sistemleri","Elektronik Malzemeler","Atom ve Molekül Fiziği","Analitik Kimya","Analiz ve Fonksiyonlar Teorisi","Hidrobiyoloji","Ekonometri ve Kantitatif İktisat","Sayısal Yöntemler","Bilim ve Teknoloji Stratejileri","Yönetim Bilişim Sistemleri","Endüstriyel Tasarım","Bina Bilgisi","Bölge Planlama","Uçak Mühendisliği","-","-","-","-","-","-","Siber Güv. Analistliği ve Operatörlüğü","-","-","-","-"]
[null,null,null,null,null,null,null,null,null,null,null,null,null,null,null,null,{"$f":"SUBSTITUTE(D10,\" \",\"_\")","v":"Bilgisayar_Teknolojileri"},"Araştırma Görevlisi (Öncelikli Alan)",2,2,"Başarılı (Yedek)","5 lik",null,null,"Temel Bilimler Fakültesi",null,"Rektörlük Ders Verilecek Birim","Biyomühendislik","Kimya","İşletme","Mimarlık",null,null,null,null,null,null,null,null,null,null,null,null,null,null,null,"Bilgisayar Mühendisliği Kuramsal Temeller","Biyomalzeme","Çevre Yönetimi ve Planlaması","Elektromanyetik Alanlar ve Mikrodalga Tekniği","Yöneylem Araştırması","Jeodezi","Hidrolik","Kimyasal Teknolojiler","Makine Teorisi Sistem Dinamiği ve Kontrol","Polimer Malzemeler","Genel Fizik","Anorganik Kimya","Cebir ve Sayılar Teorisi","Genel Biyoloji","İktisadi Gelişme ve Uluslararası İktisat","Muhasebe ve Finansman","Milli Güvenlik Stratejileri",null,null,"Mimari Tasarım Kuram ve Yöntemleri","Şehircilik"]
[null,null,null,null,null,null,null,null,null,null,null,null,null,null,null,null,null,"Öğretim Görevlisi (Tarih-Türkçe-Uygulamalı Birim)",3,3,"Başarısız","100 lük",null,null,"İşletme Fakültesi",null,"Beden Eğitimi ve Spor","Çevre Mühendisliği","Matematik","Strateji Bilimi","Şehir ve Bölge Planlama",null,null,null,null,null,null,null,null,null,null,null,null,null,null,null,"Bilgisayar Yazılımı","Biyomekanik","Hava Kirliliği ve Kontrol Teknolojisi","Elektronik",null,"Kamu Ölçmeleri","Ulaştırma","Proses ve Reaktör Tasarımı","Tasarım ve İmalat Mühendisliği","Malzeme Bilimi","Medikal Fizik","Bitki Kimyası","Geometri","Genetik","İktisat Politikası","Üretim Yönetimi ve Pazarlama","Yönetim Stratejileri",null,null,"Mimarlık Tarihi"]
[null,null,null,null,null,null,null,null,null,null,null,null,null,null,null,null,null,"Öğretim Görevlisi (Yabancı Dil Eğitimi veren\\Öğrenim yapan birim)",4,4,"Sınava Girmedi",null,null,null,"Mimarlık Fakültesi",null,"Enformatik","Elektronik Mühendisliği","Moleküler Biyoloji ve Genetik","Yönetim Bilişim Sistemleri",null,null,null,null,null,null,null,null,null,null,null,null,null,null,null,null,"Kontrol ve Kumanda Sistemler",null,"Su Kirliliği ve Atıksu Kontrol Teknolojisi","Telekomünikasyon",null,"Kartografya","Yapı","Temel İşlemler ve Termodinamik","Mekanik","Metalurji","Nükleer Fizik","Biyokimya","Matematiğin Temelleri ve Lojik","Hücre Biyolojisi","İktisat Teorisi","Yönetim ve Organizasyon",null,null,null,"Restorasyon"]
[null,null,"Form No :","FR-0447",null,"Yayın Tarihi :",null,"2018-08-03",null,"Değiştirme No :",null,9,"Değiştirme Tarihi :",null,"2023-12-13",null,null,null,5,5,null,null,null,null,"Havacılık ve Uzay Bilimleri Fakültesi",null,"Türkçe Hazırlık","Endüstri Mühendisliği",null,null,null,null,null,null,null,null,null,null,null,null,null,null,null,null,null,null,null,null,"Toprak Kirliliği ve Katı Atık Uzaklaştırma Teknolojisi",null,null,"Ölçme Tekniği","Yapı Malzemeleri",null,"Akışkanlar Mekaniği","Seramik Malzemeleri","Katıhal Fiziği","Fizikokimya","Topoloji","Moleküler Biyoloji",null,null,null,null,null,"Yapı Bilgisi"]
["09/11/2018 tarihli ve 30590 sayılı Resmi Gazete'de yayımlanan \"Öğretim Üyesi Dışındaki Öğretim Elemanı Kadrolarına Yapılacak Atamalarda Uygulanacak Merkezi Sınav İle Giriş Sınavlarına İlişkin Usul ve Esaslar Hakkında Yönetmelik\" hükümleri çerçevesinde aşağıda birim ve kadro ünvanı belirtilen öğretim elemanı kadrolarına yapılan başvurular anılan Yönetmeliğin 12.maddesi uyarınca değerlendirmeye tabi tutulmuş olup aşağıdaki şekilde sonuçlandırılmıştır.",null,null,null,null,null,null,null,null,null,null,null,null,null,null,null,null,null,6,6,null,null,null,null,"Bilişim Teknolojileri Enstitüsü",null,"Yabancı Diller","Harita Mühendisliği",null,null,null,null,null,null,null,null,null,null,null,null,null,null,null,null,null,null,null,null,null,null,null,null,"Yapım Yönetimi",null,null,null,null,"Organik Kimya","Uygulamalı Matematik"]
[null,null,null,null,null,null,null,null,null,null,null,null,null,null,null,null,null,null,7,7,null,null,null,null,"Biyoteknoloji Enstitüsü",null,null,"İnşaat Mühendisliği",null,null,null,null,null,null,null,null,null,null,null,null,null,null,null,null,null,null,null,null,null,null,null,null,"Mekanik"]
["İLAN EDİLEN",null,"Birim :","Siber Güvenlik Meslek Yüksekokulu",null,null,null,null,null,null,null,null,null,null,null,null,null,null,null,8,null,null,null,null,"Enerji Teknolojileri Enstitüsü",null,null,"Kimya Mühendisliği"]
[null,null,"Bölüm :","Bilgisayar Teknolojileri",null,null,null,null,null,null,null,null,null,null,null,null,null,null,null,9,null,null,null,null,"Lisansüstü Eğitim Enstitüsü",null,null,"Makine Mühendisliği"]
[null,null,"Anabilim Dalı/Program :","Siber Güv. Analistliği ve Operatörlüğü",null,null,null,null,null,null,null,null,null,null,null,null,null,null,null,10,null,null,null,null,"Nanoteknoloji Enstitüsü",null,null,"Malzeme Bilimi ve Mühendisliği"]
[null,null,"Kadro Unvanı :","Öğretim Görevlisi (Yabancı Dil Eğitimi veren\\Öğrenim yapan birim)",null,null,null,null,null,null,null,null,null,null,null,null,null,null,null,null,null,null,null,null,"Savunma Teknolojileri Enstitüsü"]
[null,null,"Kadro Derecesi :",7,null,null,null,null,null,null,null,null,null,null,null,null,null,null,null,null,null,null,null,null,"Ulaşım Teknolojileri Enstitüsü"]
[null,null,"Kadro Adedi :",1,null,null,null,null,null,null,null,null,null,null,null,null,null,null,null,null,null,null,null,null,"Yer ve Deniz Bilimleri Enstitüsü"]
[null,null,"İlan Numarası :",null,null,null,null,null,null,null,null,null,null,null,null,null,null,null,null,null,null,null,null,null,"Siber Güvenlik Meslek Yüksekokulu"]
[]
["S.\nNo","T.C. KİMLİK NO","ADI SOYADI","ALES \nPUANI","Y.DİL \nPUANI","MEZUNİYET\nNOT\nSİSTEMİ","MEZUNİYET NOTU","100 LÜK\nMEZUNİYET\nNOTU","GİRİŞ \nSINAVI","ALES","Y. DİL","MEZUNİYET","GİRİŞ SINAVI","TOPLAM","SONUÇ "]
[null,null,null,null,null,null,null,null,null,{"$f":"IF(D12=\"Araştırma Görevlisi\",0.3,IF(D12=\"Araştırma Görevlisi (Öncelikli Alan)\",0.4,IF(D12=\"Öğretim Görevlisi (Tarih-Türkçe-Uygulamalı Birim)\",0.3,0.3)))","v":0.3},{"$f":"IF(D12=\"Araştırma Görevlisi\",0.1,IF(D12=\"Araştırma Görevlisi (Öncelikli Alan)\",0.3,IF(D12=\"Öğretim Görevlisi (Tarih-Türkçe-Uygulamalı Birim)\",0.1,0.3)))","v":0.3},{"$f":"IF(D12=\"Araştırma Görevlisi\",0.3,IF(D12=\"Araştırma Görevlisi (Öncelikli Alan)\",0.15,IF(D12=\"Öğretim Görevlisi (Tarih-Türkçe-Uygulamalı Birim)\",0.3,0.1)))","v":0.1},{"$f":"IF(D12=\"Araştırma Görevlisi\",0.3,IF(D12=\"Araştırma Görevlisi (Öncelikli Alan)\",0.15,IF(D12=\"Öğretim Görevlisi (Tarih-Türkçe-Uygulamalı Birim)\",0.3,0.3)))","v":0.3}]
[1,null,null,null,null,null,null,{"$f":"IF(F19=$V$3,VLOOKUP(G19,'5LIK'!$A$2:$B$377,2,0),IF(F19=$V$2,VLOOKUP(G19,'4LUK'!$A$3:$B$303,2,0),IF(F19=$V$4,G19,0)))","v":0},null,{"$f":"ROUND((D19*$J$18),4)","v":0},{"$f":"ROUND((E19*$K$18),4)","v":0},{"$f":"ROUND((H19*$L$18),4)","v":0},{"$f":"IF($D$12=\"Araştırma Görevlisi\",ROUND(($I19*$M$18),4),IF($D$12=\"Öğretim Görevlisi (Tarih-Türkçe-Uygulamalı Birim)\",ROUND(($I19*$M$18),4),IF($I19>=1,ROUND(($I19*$M$18),4),IF($I19=0,ROUND(($I19*$M$18),4),\"Giriş Sınavı Başarısız\"))))","v":0},{"$f":"IF($D$12=\"Araştırma Görevlisi\",SUM(($J19+$K19+$L19+$M19)),IF($D$12=\"Öğretim Görevlisi (Tarih-Türkçe-Uygulamalı Birim)\",SUM(($J19+$K19+$L19+$M19)),IF($I19>=1,SUM($J19+$K19+$L19+$M19),0)))","v":0}]
[2,null,null,null,null,null,null,{"$f":"IF(F20=$V$3,VLOOKUP(G20,'5LIK'!$A$2:$B$377,2,0),IF(F20=$V$2,VLOOKUP(G20,'4LUK'!$A$3:$B$303,2,0),IF(F20=$V$4,G20,0)))","v":0},null,0,0,0,0,0,null,null,null,null,null,null,null,null,null,null,null,null,null,null,null,null,null,null,null,null,null,null,null,null,null,null,null,null,null,null,null,null,null,null,null,null,null,null,null,null,null,null,null,null,null,null,null,null,null,null,null,null,null,null,null,null,null,null,null,null,null,null,null,null,null,null,null,null,null,{"$f":"IF($D$12=\"Araştırma Görevlisi\",IF($N19>=65,SUM($J19+$K19+$L19+$M19),0),IF($D$12=\"Öğretim Görevlisi (Tarih-Türkçe-Uygulamalı Birim)\",IF($N19>=65,SUM($J19+$K19+$L19+$M19),0),IF($I19>=60,SUM($J19+$K19+$L19+$M19),0)))","v":0}]
[3,null,null,null,null,null,null,{"$f":"IF(F21=$V$3,VLOOKUP(G21,'5LIK'!$A$2:$B$377,2,0),IF(F21=$V$2,VLOOKUP(G21,'4LUK'!$A$3:$B$303,2,0),IF(F21=$V$4,G21,0)))","v":0},null,0,0,0,0,0]
[4,null,null,null,null,null,null,{"$f":"IF(F22=$V$3,VLOOKUP(G22,'5LIK'!$A$2:$B$377,2,0),IF(F22=$V$2,VLOOKUP(G22,'4LUK'!$A$3:$B$303,2,0),IF(F22=$V$4,G22,0)))","v":0},null,0,0,0,0,0]
[5,null,null,null,null,null,null,{"$f":"IF(F23=$V$3,VLOOKUP(G23,'5LIK'!$A$2:$B$377,2,0),IF(F23=$V$2,VLOOKUP(G23,'4LUK'!$A$3:$B$303,2,0),IF(F23=$V$4,G23,0)))","v":0},null,0,0,0,0,0]
[6,null,null,null,null,null,null,{"$f":"IF(F24=$V$3,VLOOKUP(G24,'5LIK'!$A$2:$B$377,2,0),IF(F24=$V$2,VLOOKUP(G24,'4LUK'!$A$3:$B$303,2,0),IF(F24=$V$4,G24,0)))","v":0},null,0,0,0,0,0]
[7,null,null,null,null,null,null,{"$f":"IF(F25=$V$3,VLOOKUP(G25,'5LIK'!$A$2:$B$377,2,0),IF(F25=$V$2,VLOOKUP(G25,'4LUK'!$A$3:$B$303,2,0),IF(F25=$V$4,G25,0)))","v":0},null,0,0,0,0,0]
[8,null,null,null,null,null,null,{"$f":"IF(F26=$V$3,VLOOKUP(G26,'5LIK'!$A$2:$B$377,2,0),IF(F26=$V$2,VLOOKUP(G26,'4LUK'!$A$3:$B$303,2,0),IF(F26=$V$4,G26,0)))","v":0},null,0,0,0,0,0]
[9,null,null,null,null,null,null,{"$f":"IF(F27=$V$3,VLOOKUP(G27,'5LIK'!$A$2:$B$377,2,0),IF(F27=$V$2,VLOOKUP(G27,'4LUK'!$A$3:$B$303,2,0),IF(F27=$V$4,G27,0)))","v":0},null,0,0,0,0,0]
[10,null,null,null,null,null,null,{"$f":"IF(F28=$V$3,VLOOKUP(G28,'5LIK'!$A$2:$B$377,2,0),IF(F28=$V$2,VLOOKUP(G28,'4LUK'!$A$3:$B$303,2,0),IF(F28=$V$4,G28,0)))","v":0},null,0,0,0,0,0]
[null,null,null,null,null,null,null,{"$f":"IF(F29=$V$3,VLOOKUP(G29,'5LIK'!$A$2:$B$377,2,0),IF(F29=$V$2,VLOOKUP(G29,'4LUK'!$A$3:$B$303,2,0),IF(F29=$V$4,G29,0)))","v":0},null,0,0,0,0,0]
[null,null,null,null,null,null,null,{"$f":"IF(F30=$V$3,VLOOKUP(G30,'5LIK'!$A$2:$B$377,2,0),IF(F30=$V$2,VLOOKUP(G30,'4LUK'!$A$3:$B$303,2,0),IF(F30=$V$4,G30,0)))","v":0},null,0,0,0,0,0]
[null,null,null,null,null,null,null,{"$f":"IF(F31=$V$3,VLOOKUP(G31,'5LIK'!$A$2:$B$377,2,0),IF(F31=$V$2,VLOOKUP(G31,'4LUK'!$A$3:$B$303,2,0),IF(F31=$V$4,G31,0)))","v":0},null,0,0,0,0,0]
[null,null,null,null,null,null,null,{"$f":"IF(F32=$V$3,VLOOKUP(G32,'5LIK'!$A$2:$B$377,2,0),IF(F32=$V$2,VLOOKUP(G32,'4LUK'!$A$3:$B$303,2,0),IF(F32=$V$4,G32,0)))","v":0},null,0,0,0,0,0]
[null,null,null,null,null,null,null,{"$f":"IF(F33=$V$3,VLOOKUP(G33,'5LIK'!$A$2:$B$377,2,0),IF(F33=$V$2,VLOOKUP(G33,'4LUK'!$A$3:$B$303,2,0),IF(F33=$V$4,G33,0)))","v":0},null,0,0,0,0,0]
[null,null,null,null,null,null,null,{"$f":"IF(F34=$V$3,VLOOKUP(G34,'5LIK'!$A$2:$B$377,2,0),IF(F34=$V$2,VLOOKUP(G34,'4LUK'!$A$3:$B$303,2,0),IF(F34=$V$4,G34,0)))","v":0},null,0,0,0,0,0]
[null,null,null,null,null,null,null,{"$f":"IF(F35=$V$3,VLOOKUP(G35,'5LIK'!$A$2:$B$377,2,0),IF(F35=$V$2,VLOOKUP(G35,'4LUK'!$A$3:$B$303,2,0),IF(F35=$V$4,G35,0)))","v":0},null,0,0,0,0,0]
[null,null,null,null,null,null,null,{"$f":"IF(F36=$V$3,VLOOKUP(G36,'5LIK'!$A$2:$B$377,2,0),IF(F36=$V$2,VLOOKUP(G36,'4LUK'!$A$3:$B$303,2,0),IF(F36=$V$4,G36,0)))","v":0},null,0,0,0,0,0]
[null,null,null,null,null,null,null,{"$f":"IF(F37=$V$3,VLOOKUP(G37,'5LIK'!$A$2:$B$377,2,0),IF(F37=$V$2,VLOOKUP(G37,'4LUK'!$A$3:$B$303,2,0),IF(F37=$V$4,G37,0)))","v":0},null,0,0,0,0,0]
[null,null,null,null,null,null,null,{"$f":"IF(F38=$V$3,VLOOKUP(G38,'5LIK'!$A$2:$B$377,2,0),IF(F38=$V$2,VLOOKUP(G38,'4LUK'!$A$3:$B$303,2,0),IF(F38=$V$4,G38,0)))","v":0},null,0,0,0,0,0]
[null,null,null,null,null,null,null,{"$f":"IF(F39=$V$3,VLOOKUP(G39,'5LIK'!$A$2:$B$377,2,0),IF(F39=$V$2,VLOOKUP(G39,'4LUK'!$A$3:$B$303,2,0),IF(F39=$V$4,G39,0)))","v":0},null,0,0,0,0,0]
[null,null,null,null,null,null,null,{"$f":"IF(F40=$V$3,VLOOKUP(G40,'5LIK'!$A$2:$B$377,2,0),IF(F40=$V$2,VLOOKUP(G40,'4LUK'!$A$3:$B$303,2,0),IF(F40=$V$4,G40,0)))","v":0},null,0,0,0,0,0]
[null,null,null,null,null,null,null,{"$f":"IF(F41=$V$3,VLOOKUP(G41,'5LIK'!$A$2:$B$377,2,0),IF(F41=$V$2,VLOOKUP(G41,'4LUK'!$A$3:$B$303,2,0),IF(F41=$V$4,G41,0)))","v":0},null,0,0,0,0,0]
[null,null,null,null,null,null,null,{"$f":"IF(F42=$V$3,VLOOKUP(G42,'5LIK'!$A$2:$B$377,2,0),IF(F42=$V$2,VLOOKUP(G42,'4LUK'!$A$3:$B$303,2,0),IF(F42=$V$4,G42,0)))","v":0},null,0,0,0,0,0]
[null,null,null,null,null,null,null,{"$f":"IF(F43=$V$3,VLOOKUP(G43,'5LIK'!$A$2:$B$377,2,0),IF(F43=$V$2,VLOOKUP(G43,'4LUK'!$A$3:$B$303,2,0),IF(F43=$V$4,G43,0)))","v":0},null,0,0,0,0,0]
[null,null,null,null,null,null,null,{"$f":"IF(F44=$V$3,VLOOKUP(G44,'5LIK'!$A$2:$B$377,2,0),IF(F44=$V$2,VLOOKUP(G44,'4LUK'!$A$3:$B$303,2,0),IF(F44=$V$4,G44,0)))","v":0},null,0,0,0,0,0]
[null,null,null,null,null,null,null,{"$f":"IF(F45=$V$3,VLOOKUP(G45,'5LIK'!$A$2:$B$377,2,0),IF(F45=$V$2,VLOOKUP(G45,'4LUK'!$A$3:$B$303,2,0),IF(F45=$V$4,G45,0)))","v":0},null,0,0,0,0,0]
[null,null,null,null,null,null,null,{"$f":"IF(F46=$V$3,VLOOKUP(G46,'5LIK'!$A$2:$B$377,2,0),IF(F46=$V$2,VLOOKUP(G46,'4LUK'!$A$3:$B$303,2,0),IF(F46=$V$4,G46,0)))","v":0},null,0,0,0,0,0]
[null,null,null,null,null,null,null,{"$f":"IF(F47=$V$3,VLOOKUP(G47,'5LIK'!$A$2:$B$377,2,0),IF(F47=$V$2,VLOOKUP(G47,'4LUK'!$A$3:$B$303,2,0),IF(F47=$V$4,G47,0)))","v":0},null,0,0,0,0,0]
[null,null,null,null,null,null,null,{"$f":"IF(F48=$V$3,VLOOKUP(G48,'5LIK'!$A$2:$B$377,2,0),IF(F48=$V$2,VLOOKUP(G48,'4LUK'!$A$3:$B$303,2,0),IF(F48=$V$4,G48,0)))","v":0},null,0,0,0,0,0]
[null,null,null,null,null,null,null,{"$f":"IF(F49=$V$3,VLOOKUP(G49,'5LIK'!$A$2:$B$377,2,0),IF(F49=$V$2,VLOOKUP(G49,'4LUK'!$A$3:$B$303,2,0),IF(F49=$V$4,G49,0)))","v":0},null,0,0,0,0,0]
[null,null,null,null,null,null,null,{"$f":"IF(F50=$V$3,VLOOKUP(G50,'5LIK'!$A$2:$B$377,2,0),IF(F50=$V$2,VLOOKUP(G50,'4LUK'!$A$3:$B$303,2,0),IF(F50=$V$4,G50,0)))","v":0},null,0,0,0,0,0]
[null,null,null,null,null,null,null,{"$f":"IF(F51=$V$3,VLOOKUP(G51,'5LIK'!$A$2:$B$377,2,0),IF(F51=$V$2,VLOOKUP(G51,'4LUK'!$A$3:$B$303,2,0),IF(F51=$V$4,G51,0)))","v":0},null,0,0,0,0,0]
[null,null,null,null,null,null,null,{"$f":"IF(F52=$V$3,VLOOKUP(G52,'5LIK'!$A$2:$B$377,2,0),IF(F52=$V$2,VLOOKUP(G52,'4LUK'!$A$3:$B$303,2,0),IF(F52=$V$4,G52,0)))","v":0},null,0,0,0,0,0]
[null,null,null,null,null,null,null,{"$f":"IF(F53=$V$3,VLOOKUP(G53,'5LIK'!$A$2:$B$377,2,0),IF(F53=$V$2,VLOOKUP(G53,'4LUK'!$A$3:$B$303,2,0),IF(F53=$V$4,G53,0)))","v":0},null,0,0,0,0,0]
[null,null,null,null,null,null,null,{"$f":"IF(F54=$V$3,VLOOKUP(G54,'5LIK'!$A$2:$B$377,2,0),IF(F54=$V$2,VLOOKUP(G54,'4LUK'!$A$3:$B$303,2,0),IF(F54=$V$4,G54,0)))","v":0},null,0,0,0,0,0]
[null,null,null,null,null,null,null,{"$f":"IF(F55=$V$3,VLOOKUP(G55,'5LIK'!$A$2:$B$377,2,0),IF(F55=$V$2,VLOOKUP(G55,'4LUK'!$A$3:$B$303,2,0),IF(F55=$V$4,G55,0)))","v":0},null,0,0,0,0,0]
[null,null,null,null,null,null,null,{"$f":"IF(F56=$V$3,VLOOKUP(G56,'5LIK'!$A$2:$B$377,2,0),IF(F56=$V$2,VLOOKUP(G56,'4LUK'!$A$3:$B$303,2,0),IF(F56=$V$4,G56,0)))","v":0},null,0,0,0,0,0]
[null,null,null,null,null,null,null,{"$f":"IF(F57=$V$3,VLOOKUP(G57,'5LIK'!$A$2:$B$377,2,0),IF(F57=$V$2,VLOOKUP(G57,'4LUK'!$A$3:$B$303,2,0),IF(F57=$V$4,G57,0)))","v":0},null,0,0,0,0,0]
[null,null,null,null,null,null,null,{"$f":"IF(F58=$V$3,VLOOKUP(G58,'5LIK'!$A$2:$B$377,2,0),IF(F58=$V$2,VLOOKUP(G58,'4LUK'!$A$3:$B$303,2,0),IF(F58=$V$4,G58,0)))","v":0},null,0,0,0,0,0]
[null,null,null,null,null,null,null,{"$f":"IF(F59=$V$3,VLOOKUP(G59,'5LIK'!$A$2:$B$377,2,0),IF(F59=$V$2,VLOOKUP(G59,'4LUK'!$A$3:$B$303,2,0),IF(F59=$V$4,G59,0)))","v":0},null,0,0,0,0,0]
[null,null,null,null,null,null,null,{"$f":"IF(F60=$V$3,VLOOKUP(G60,'5LIK'!$A$2:$B$377,2,0),IF(F60=$V$2,VLOOKUP(G60,'4LUK'!$A$3:$B$303,2,0),IF(F60=$V$4,G60,0)))","v":0},null,0,0,0,0,0]
[null,null,null,null,null,null,null,{"$f":"IF(F61=$V$3,VLOOKUP(G61,'5LIK'!$A$2:$B$377,2,0),IF(F61=$V$2,VLOOKUP(G61,'4LUK'!$A$3:$B$303,2,0),IF(F61=$V$4,G61,0)))","v":0},null,0,0,0,0,0]
[null,null,null,null,null,null,null,{"$f":"IF(F62=$V$3,VLOOKUP(G62,'5LIK'!$A$2:$B$377,2,0),IF(F62=$V$2,VLOOKUP(G62,'4LUK'!$A$3:$B$303,2,0),IF(F62=$V$4,G62,0)))","v":0},null,0,0,0,0,0]
[null,null,null,null,null,null,null,{"$f":"IF(F63=$V$3,VLOOKUP(G63,'5LIK'!$A$2:$B$377,2,0),IF(F63=$V$2,VLOOKUP(G63,'4LUK'!$A$3:$B$303,2,0),IF(F63=$V$4,G63,0)))","v":0},null,0,0,0,0,0]
[null,null,null,null,null,null,null,{"$f":"IF(F64=$V$3,VLOOKUP(G64,'5LIK'!$A$2:$B$377,2,0),IF(F64=$V$2,VLOOKUP(G64,'4LUK'!$A$3:$B$303,2,0),IF(F64=$V$4,G64,0)))","v":0},null,0,0,0,0,0]
[null,null,null,null,null,null,null,{"$f":"IF(F65=$V$3,VLOOKUP(G65,'5LIK'!$A$2:$B$377,2,0),IF(F65=$V$2,VLOOKUP(G65,'4LUK'!$A$3:$B$303,2,0),IF(F65=$V$4,G65,0)))","v":0},null,0,0,0,0,0]
[null,null,null,null,null,null,null,{"$f":"IF(F66=$V$3,VLOOKUP(G66,'5LIK'!$A$2:$B$377,2,0),IF(F66=$V$2,VLOOKUP(G66,'4LUK'!$A$3:$B$303,2,0),IF(F66=$V$4,G66,0)))","v":0},null,0,0,0,0,0]
[null,null,null,null,null,null,null,{"$f":"IF(F67=$V$3,VLOOKUP(G67,'5LIK'!$A$2:$B$377,2,0),IF(F67=$V$2,VLOOKUP(G67,'4LUK'!$A$3:$B$303,2,0),IF(F67=$V$4,G67,0)))","v":0},null,0,0,0,0,0]
[null,null,null,null,null,null,null,{"$f":"IF(F68=$V$3,VLOOKUP(G68,'5LIK'!$A$2:$B$377,2,0),IF(F68=$V$2,VLOOKUP(G68,'4LUK'!$A$3:$B$303,2,0),IF(F68=$V$4,G68,0)))","v":0},null,0,0,0,0,0]
[null,null,null,null,null,null,null,{"$f":"IF(F69=$V$3,VLOOKUP(G69,'5LIK'!$A$2:$B$377,2,0),IF(F69=$V$2,VLOOKUP(G69,'4LUK'!$A$3:$B$303,2,0),IF(F69=$V$4,G69,0)))","v":0},null,0,0,0,0,0]
[null,null,null,null,null,null,null,{"$f":"IF(F70=$V$3,VLOOKUP(G70,'5LIK'!$A$2:$B$377,2,0),IF(F70=$V$2,VLOOKUP(G70,'4LUK'!$A$3:$B$303,2,0),IF(F70=$V$4,G70,0)))","v":0},null,0,0,0,0,0]
[null,null,null,null,null,null,null,{"$f":"IF(F71=$V$3,VLOOKUP(G71,'5LIK'!$A$2:$B$377,2,0),IF(F71=$V$2,VLOOKUP(G71,'4LUK'!$A$3:$B$303,2,0),IF(F71=$V$4,G71,0)))","v":0},null,0,0,0,0,0]
[null,null,null,null,null,null,null,{"$f":"IF(F72=$V$3,VLOOKUP(G72,'5LIK'!$A$2:$B$377,2,0),IF(F72=$V$2,VLOOKUP(G72,'4LUK'!$A$3:$B$303,2,0),IF(F72=$V$4,G72,0)))","v":0},null,0,0,0,0,0]
[null,null,null,null,null,null,null,{"$f":"IF(F73=$V$3,VLOOKUP(G73,'5LIK'!$A$2:$B$377,2,0),IF(F73=$V$2,VLOOKUP(G73,'4LUK'!$A$3:$B$303,2,0),IF(F73=$V$4,G73,0)))","v":0},null,0,0,0,0,0]
[null,null,null,null,null,null,null,{"$f":"IF(F74=$V$3,VLOOKUP(G74,'5LIK'!$A$2:$B$377,2,0),IF(F74=$V$2,VLOOKUP(G74,'4LUK'!$A$3:$B$303,2,0),IF(F74=$V$4,G74,0)))","v":0},null,0,0,0,0,0]
[null,null,null,null,null,null,null,{"$f":"IF(F75=$V$3,VLOOKUP(G75,'5LIK'!$A$2:$B$377,2,0),IF(F75=$V$2,VLOOKUP(G75,'4LUK'!$A$3:$B$303,2,0),IF(F75=$V$4,G75,0)))","v":0},null,0,0,0,0,0]
[null,null,null,null,null,null,null,{"$f":"IF(F76=$V$3,VLOOKUP(G76,'5LIK'!$A$2:$B$377,2,0),IF(F76=$V$2,VLOOKUP(G76,'4LUK'!$A$3:$B$303,2,0),IF(F76=$V$4,G76,0)))","v":0},null,0,0,0,0,0]
[null,null,null,null,null,null,null,{"$f":"IF(F77=$V$3,VLOOKUP(G77,'5LIK'!$A$2:$B$377,2,0),IF(F77=$V$2,VLOOKUP(G77,'4LUK'!$A$3:$B$303,2,0),IF(F77=$V$4,G77,0)))","v":0},null,0,0,0,0,0]
[null,null,null,null,null,null,null,{"$f":"IF(F78=$V$3,VLOOKUP(G78,'5LIK'!$A$2:$B$377,2,0),IF(F78=$V$2,VLOOKUP(G78,'4LUK'!$A$3:$B$303,2,0),IF(F78=$V$4,G78,0)))","v":0},null,0,0,0,0,0]
[null,null,null,null,null,null,null,{"$f":"IF(F79=$V$3,VLOOKUP(G79,'5LIK'!$A$2:$B$377,2,0),IF(F79=$V$2,VLOOKUP(G79,'4LUK'!$A$3:$B$303,2,0),IF(F79=$V$4,G79,0)))","v":0},null,0,0,0,0,0]
[null,null,null,null,null,null,null,{"$f":"IF(F80=$V$3,VLOOKUP(G80,'5LIK'!$A$2:$B$377,2,0),IF(F80=$V$2,VLOOKUP(G80,'4LUK'!$A$3:$B$303,2,0),IF(F80=$V$4,G80,0)))","v":0},null,0,0,0,0,0]
{"$rows_left_out":239}
{"sheet":"4LUK","index":1,"n_rows":303,"n_cols":2,"rows_kept":303,"cut":false,"hidden":true,"merged":[[0,0,0,1],[1,0,1,1]]}
["YÜKSEKÖĞRETİM KURULU"]
["4’lük Sistemdeki Notların 100’lük Sistemdeki Karşılıkları"]
[1,30]
[1.01,30.23]
[1.02,30.46]
[1.03,30.7]
[1.04,30.93]
[1.05,31.16]
[1.06,31.4]
[1.07,31.63]
[1.08,31.86]
[1.0900000000000001,32.1]
[1.1000000000000001,32.33]
[1.1100000000000001,32.56]
[1.1200000000000001,32.799999999999997]
[1.1299999999999999,33.03]
[1.1399999999999999,33.26]
[1.1499999999999999,33.5]
[1.1599999999999999,33.729999999999997]
[1.17,33.96]
[1.18,34.200000000000003]
[1.19,34.43]
[1.2,34.659999999999997]
[1.21,34.9]
[1.22,35.130000000000003]
[1.23,35.36]
[1.24,35.6]
[1.25,35.83]
[1.26,36.06]
[1.27,36.299999999999997]
[1.28,36.53]
[1.29,36.76]
[1.3,37]
[1.31,37.229999999999997]
[1.32,37.46]
[1.33,37.700000000000003]
[1.34,37.93]
[1.35,38.159999999999997]
[1.36,38.4]
[1.37,38.630000000000003]
[1.38,38.86]
[1.39,39.1]
[1.4,39.33]
[1.41,39.56]
[1.42,39.799999999999997]
[1.43,40.03]
[1.44,40.26]
[1.45,40.5]
[1.46,40.729999999999997]
[1.47,40.96]
[1.48,41.2]
[1.49,41.43]
[1.5,41.66]
[1.51,41.9]
[1.52,42.13]
[1.53,42.36]
[1.54,42.6]
[1.55,42.83]
[1.56,43.06]
[1.57,43.3]
[1.58,43.53]
[1.59,43.76]
[1.6,44]
[1.61,44.23]
[1.62,44.46]
[1.63,44.7]
[1.64,44.93]
[1.65,45.16]
[1.66,45.4]
[1.67,45.63]
[1.68,45.86]
[1.69,46.1]
[1.7,46.33]
[1.71,46.56]
[1.72,46.8]
[1.73,47.03]
[1.74,47.26]
[1.75,47.5]
[1.76,47.73]
[1.77,47.96]
{"$rows_left_out":224}
{"sheet":"5LIK","index":2,"n_rows":377,"n_cols":2,"rows_kept":377,"cut":false,"hidden":true,"merged":[]}
["5'lik Sistem","100'lük Sistem"]
[1.25,30]
[1.26,30.19]
[1.27,30.37]
[1.28,30.56]
[1.29,30.75]
[1.3,30.93]
[1.31,31.12]
[1.32,31.31]
[1.33,31.49]
[1.34,31.68]
[1.35,31.87]
[1.36,32.049999999999997]
[1.37,32.24]
[1.38,32.43]
[1.39,32.61]
[1.4,32.799999999999997]
[1.41,32.99]
[1.42,33.17]
[1.43,33.36]
[1.44,33.549999999999997]
[1.45,33.729999999999997]
[1.46,33.92]
[1.47,34.11]
[1.48,34.29]
[1.49,34.479999999999997]
[1.5,34.67]
[1.51,34.85]
[1.52,35.04]
[1.53,35.229999999999997]
[1.54,35.409999999999997]
[1.55,35.6]
[1.56,35.79]
[1.57,35.97]
[1.58,36.159999999999997]
[1.59,36.35]
[1.6,36.53]
[1.61,36.72]
[1.62,36.909999999999997]
[1.63,37.090000000000003]
[1.64,37.28]
[1.65,37.47]
[1.66,37.65]
[1.67,37.840000000000003]
[1.68,38.03]
[1.69,38.21]
[1.7,38.4]
[1.71,38.590000000000003]
[1.72,38.770000000000003]
[1.73,38.96]
[1.74,39.15]
[1.75,39.33]
[1.76,39.520000000000003]
[1.77,39.71]
[1.78,39.89]
[1.79,40.08]
[1.8,40.270000000000003]
[1.81,40.450000000000003]
[1.82,40.64]
[1.83,40.83]
[1.84,41.01]
[1.85,41.2]
[1.86,41.39]
[1.87,41.57]
[1.88,41.76]
[1.89,41.95]
[1.9,42.13]
[1.91,42.32]
[1.92,42.51]
[1.93,42.69]
[1.94,42.88]
[1.95,43.07]
[1.96,43.25]
[1.97,43.44]
[1.98,43.63]
[1.99,43.81]
[2,44]
[2.0099999999999998,44.19]
[2.02,44.37]
[2.0299999999999998,44.56]
{"$rows_left_out":297}